아키텍처 arm64에 대한 정의되지 않은 심볼 : 빌드 RoboVM / LibGDX 프로젝트에 실패

개그 Baghdasaryan :

내 IOS 장치에 roboVM / libgdx 응용 프로그램을 만들려고 할 때, 나는 다음과 같은 오류를보고 있어요.

[ERROR] 13:49:29.414 Undefined symbols for architecture arm64:
[ERROR] 13:49:29.414   "_OBJC_CLASS_$_GADInterstitial", referenced from:
[ERROR] 13:49:29.415       objc-class-ref in libGGLAdMob.a(GGLContext+AdMob.o)
[ERROR] 13:49:29.721   "_OBJC_CLASS_$_GADBannerView", referenced from:
[ERROR] 13:49:29.722       objc-class-ref in libGGLAdMob.a(GGLContext+AdMob.o)
[ERROR] 13:49:30.362 ld: symbol(s) not found for architecture arm64
[ERROR] 13:49:30.458 clang: error: linker command failed with exit code 1 (use -v to see invocation)
[ERROR] Couldn't compile app
org.apache.commons.exec.ExecuteException: Command '/Applications/Xcode.app/Contents/Developer/Toolchains/XcodeDefault.xctoolchain/usr/bin/clang++ -o /Users/gag/StudioProjects/OlympusNew/ios/robovm-build/tmp/iOS/ios/arm64/IsoGameLauncher -arch arm64 -Wl,-filelist,/Users/gag/StudioProjects/OlympusNew/ios/robovm-build/tmp/iOS/ios/arm64/objects0 -w -L /Users/gag/.robovm-sdks/robovm-2.3.6/lib/vm/ios/arm64 -ObjC -Xlinker -alias_list -Xlinker /Users/gag/StudioProjects/OlympusNew/ios/robovm-build/tmp/iOS/ios/arm64/aliased_symbols -exported_symbols_list /Users/gag/StudioProjects/OlympusNew/ios/robovm-build/tmp/iOS/ios/arm64/exported_symbols -Wl,-no_implicit_dylibs -Wl,-dead_strip -F/Users/gag/StudioProjects/OlympusNew/ios/libs -fPIC -miphoneos-version-min=10.3 -isysroot /Applications/Xcode.app/Contents/Developer/Platforms/iPhoneOS.platform/Developer/SDKs/iPhoneOS12.2.sdk -lrobovm-bc -force_load /Users/gag/.robovm-sdks/robovm-2.3.6/lib/vm/ios/arm64/librobovm-rt.a -lrobovm-debug -lrobovm-core -lgc -lpthread -ldl -lm -lz -liconv -lsqlite3 -framework Foundation -framework GoogleMobileAds -framework AdSupport -framework AudioToolbox -framework AVFoundation -framework CFNetwork -framework CoreGraphics -framework CoreMedia -framework CoreMotion -framework CoreTelephony -framework CoreVideo -framework Foundation -framework GLKit -framework JavaScriptCore -framework MediaPlayer -framework MessageUI -framework MobileCoreServices -framework OpenGLES -framework QuartzCore -framework SafariServices -framework Security -framework StoreKit -framework SystemConfiguration -framework UIKit -framework WebKit -framework Crashlytics -framework FBSDKShareKit -framework FBAudienceNetwork -framework Fabric -framework OpenAL -framework GameKit -framework FBSDKLoginKit -framework Bolts -framework FBSDKCoreKit -framework CoreData -framework FIRAnalyticsConnector -framework FirebaseAnalytics -framework FirebaseCore -framework FirebaseCoreDiagnostics -framework FirebaseInstanceID -framework GoogleAppMeasurement -framework GoogleUtilities -framework nanopb -weak_framework AdSupport -weak_framework StoreKit -force_load /Users/gag/.robovm/cache/ios/arm64/release/Users/gag/.gradle/caches/modules-2/files-2.1/com.mobidevelop.robovm/robopods-google-mobile-ads-ios/2.2.3-SNAPSHOT/cf3d14807dc3dfef4aa97bfa2143ee7aa7e83cb2/robopods-google-mobile-ads-ios-2.2.3-SNAPSHOT.jar.extracted/META-INF/robovm/ios/libs/libGGLAdMob.a -lz -lc++ -lxml2 -force_load /Users/gag/.robovm/cache/ios/arm64/release/Users/gag/.gradle/caches/modules-2/files-2.1/com.badlogicgames.gdx/gdx-freetype-platform/1.9.9/dc1091250035b61475c7b70e1ae79c1ffebea5d3/gdx-freetype-platform-1.9.9-natives-ios.jar.extracted/META-INF/robovm/ios/libs/libgdx-freetype.a -force_load /Users/gag/.robovm/cache/ios/arm64/release/Users/gag/.gradle/caches/modules-2/files-2.1/com.badlogicgames.gdx/gdx-platform/1.9.9/fa88e13e767400ddf50c9ad96d78fcebf583b697/gdx-platform-1.9.9-natives-ios.jar.extracted/META-INF/robovm/ios/libs/libgdx.a -force_load /Users/gag/.robovm/cache/ios/arm64/release/Users/gag/.gradle/caches/modules-2/files-2.1/com.badlogicgames.gdx/gdx-platform/1.9.9/fa88e13e767400ddf50c9ad96d78fcebf583b697/gdx-platform-1.9.9-natives-ios.jar.extracted/META-INF/robovm/ios/libs/libObjectAL.a -lsqlite3 -force_load /Users/gag/.robovm/cache/ios/arm64/release/Users/gag/.gradle/caches/modules-2/files-2.1/com.mobidevelop.robovm/robopods-google-apis-ios/2.2.3-SNAPSHOT/7224875ace65e987680c0d36b919bce7f97a8d3c/robopods-google-apis-ios-2.2.3-SNAPSHOT.jar.extracted/META-INF/robovm/ios/libs/libGGLCore.a -Xlinker -sdk_version -Xlinker 12.2 -Xlinker -rpath -Xlinker @executable_path/Frameworks -Xlinker -rpath -Xlinker @loader_path/Frameworks' failed (Exit value: 1)
    at org.apache.commons.exec.DefaultExecutor.executeInternal(DefaultExecutor.java:346)
    at org.apache.commons.exec.DefaultExecutor.execute(DefaultExecutor.java:149)
    at org.robovm.compiler.util.Executor.exec(Executor.java:344)
    at org.robovm.compiler.util.ToolchainUtil.link(ToolchainUtil.java:404)
    at org.robovm.compiler.target.AbstractTarget.doBuild(AbstractTarget.java:276)
    at org.robovm.compiler.target.ios.IOSTarget.doBuild(IOSTarget.java:361)
    at org.robovm.compiler.target.AbstractTarget.build(AbstractTarget.java:270)
    at org.robovm.compiler.Linker.link(Linker.java:433)
    at org.robovm.compiler.AppCompiler.compile(AppCompiler.java:514)
    at org.robovm.compiler.AppCompiler.build(AppCompiler.java:953)
    at org.robovm.idea.compilation.RoboVmCompileTask$4.doCompile(RoboVmCompileTask.java:300)
    at org.robovm.idea.compilation.RoboVmCompilerThread.run(RoboVmCompilerThread.java:66)```

그러나, 나는 어제를 실행 할 수 있었다,하지만 내 노트북을 삭제하고 모든 소프트웨어를 다운로드하고 프로젝트를 다시 체크 아웃 후, 나는이 오류가 표시하기 시작했다. 어떤 제안 무슨 일이야?

감사.

개그 Baghdasaryan :

마지막으로, 나는이 문제를 발견했다.

GoogleMobileAds.framework 140 메가 바이트, 그리고 결제 후 손상시키고, 그 크기가 40킬로바이트이었다. 그래서, 나는 우리의 자식 저장소에서 수동으로 다운로드하여 손상된 것으로 교체. 모든 것은 다시 마법처럼 작동합니다.

이 기사는 인터넷에서 수집됩니다. 재 인쇄 할 때 출처를 알려주십시오.

침해가 발생한 경우 연락 주시기 바랍니다[email protected] 삭제

에서 수정
0

몇 마디 만하겠습니다

0리뷰
로그인참여 후 검토

관련 기사

분류에서Dev

Firebase 포드가 arm64 아키텍처에 대한 중복 기호를 생성합니다.

분류에서Dev

Catalina C ++가 실패하고 "아키텍처 x86_64에 대한 정의되지 않은 기호"가 표시되는 Curl

분류에서Dev

Google 테스트 프로젝트를 빌드 할 때 'getcwd'및 'mkdir'에 대한 정의되지 않은 참조

분류에서Dev

SDL 2 (macOS)에서 "x86_64 아키텍처에 대한 정의되지 않은 기호"

분류에서Dev

Unity / Firebase 프로젝트를 빌드하는 동안 XCode의 아키텍처 arm64에 대한 정의되지 않은 기호

분류에서Dev

"x86_64 아키텍처에 대한 정의되지 않은 기호"Xcode

분류에서Dev

Hello World의 아키텍처 x86_64에 대한 정의되지 않은 기호

분류에서Dev

Rails 프로젝트 : NoMethodError : String에 대한 정의되지 않은 메서드`identifier '

분류에서Dev

zxing GreyscaleLuminanceSource XCode 5를 사용하는 프로젝트의 armv7 오류 아키텍처에 대한 정의되지 않은 기호

분류에서Dev

링커 명령이 종료 코드 1 (호출을 보려면 -v 사용) 및 아키텍처에 대한 정의되지 않은 기호로 실패했습니다.

분류에서Dev

libGDX / RoboVM 프로젝트에서 MFMailComposeViewController의 빌드 오류

분류에서Dev

osx-아키텍처 x86_64에 대한 부스트 및 파이썬 정의되지 않은 기호

분류에서Dev

아키텍처 x86_64에 대한 정의되지 않은 기호

분류에서Dev

"아키텍처 arm64에 대한 정의되지 않은 기호 :"테스트의 신속한 기능

분류에서Dev

SignalR-Objc-armv7 아키텍처에 대한 정의되지 않은 기호

분류에서Dev

arm64 아키텍처에 대해 정의되지 않은 기호입니다. ObjC ++ 파일로 C 호출을 만드시겠습니까?

분류에서Dev

armv7 아키텍처에 대한 Google AdMob 정의되지 않은 기호

분류에서Dev

ARM64 용으로 빌드 할 때 아키텍처 x86_64에 대해 정의되지 않은 기호

분류에서Dev

xcode의 아키텍처 x86_64 오류에 대한 정의되지 않은 기호

분류에서Dev

xcode의 아키텍처 x86_64 오류에 대한 정의되지 않은 기호

분류에서Dev

MobileAppTracker armv7 아키텍처에 대한 정의되지 않은 기호 :

분류에서Dev

Unity 4.6.6 Xcode 'armv7 / arm64 아키텍처에 대한 정의되지 않은 기호'링커 오류

분류에서Dev

iOS 시뮬레이터 빌드-아키텍처 i386에 대한 정의되지 않은 기호

분류에서Dev

아키텍처 x86_64에 대한 C ++ 정의되지 않은 기호

분류에서Dev

Simulator 용으로 빌드 할 때 아키텍처 x86_64에 대한 정의되지 않은 기호

분류에서Dev

아키텍처 x86_64에 대한 정의되지 않은 기호 : 링크 실수?

분류에서Dev

XCode 빌드 실패 "x86_64 아키텍처에 대한 정의되지 않은 기호"

분류에서Dev

아키텍처 arm64에 대한 Xcode 8.0 정의되지 않은 기호

분류에서Dev

ARM64 (iOS) 아키텍처에 대한 정의되지 않은 기호

Related 관련 기사

  1. 1

    Firebase 포드가 arm64 아키텍처에 대한 중복 기호를 생성합니다.

  2. 2

    Catalina C ++가 실패하고 "아키텍처 x86_64에 대한 정의되지 않은 기호"가 표시되는 Curl

  3. 3

    Google 테스트 프로젝트를 빌드 할 때 'getcwd'및 'mkdir'에 대한 정의되지 않은 참조

  4. 4

    SDL 2 (macOS)에서 "x86_64 아키텍처에 대한 정의되지 않은 기호"

  5. 5

    Unity / Firebase 프로젝트를 빌드하는 동안 XCode의 아키텍처 arm64에 대한 정의되지 않은 기호

  6. 6

    "x86_64 아키텍처에 대한 정의되지 않은 기호"Xcode

  7. 7

    Hello World의 아키텍처 x86_64에 대한 정의되지 않은 기호

  8. 8

    Rails 프로젝트 : NoMethodError : String에 대한 정의되지 않은 메서드`identifier '

  9. 9

    zxing GreyscaleLuminanceSource XCode 5를 사용하는 프로젝트의 armv7 오류 아키텍처에 대한 정의되지 않은 기호

  10. 10

    링커 명령이 종료 코드 1 (호출을 보려면 -v 사용) 및 아키텍처에 대한 정의되지 않은 기호로 실패했습니다.

  11. 11

    libGDX / RoboVM 프로젝트에서 MFMailComposeViewController의 빌드 오류

  12. 12

    osx-아키텍처 x86_64에 대한 부스트 및 파이썬 정의되지 않은 기호

  13. 13

    아키텍처 x86_64에 대한 정의되지 않은 기호

  14. 14

    "아키텍처 arm64에 대한 정의되지 않은 기호 :"테스트의 신속한 기능

  15. 15

    SignalR-Objc-armv7 아키텍처에 대한 정의되지 않은 기호

  16. 16

    arm64 아키텍처에 대해 정의되지 않은 기호입니다. ObjC ++ 파일로 C 호출을 만드시겠습니까?

  17. 17

    armv7 아키텍처에 대한 Google AdMob 정의되지 않은 기호

  18. 18

    ARM64 용으로 빌드 할 때 아키텍처 x86_64에 대해 정의되지 않은 기호

  19. 19

    xcode의 아키텍처 x86_64 오류에 대한 정의되지 않은 기호

  20. 20

    xcode의 아키텍처 x86_64 오류에 대한 정의되지 않은 기호

  21. 21

    MobileAppTracker armv7 아키텍처에 대한 정의되지 않은 기호 :

  22. 22

    Unity 4.6.6 Xcode 'armv7 / arm64 아키텍처에 대한 정의되지 않은 기호'링커 오류

  23. 23

    iOS 시뮬레이터 빌드-아키텍처 i386에 대한 정의되지 않은 기호

  24. 24

    아키텍처 x86_64에 대한 C ++ 정의되지 않은 기호

  25. 25

    Simulator 용으로 빌드 할 때 아키텍처 x86_64에 대한 정의되지 않은 기호

  26. 26

    아키텍처 x86_64에 대한 정의되지 않은 기호 : 링크 실수?

  27. 27

    XCode 빌드 실패 "x86_64 아키텍처에 대한 정의되지 않은 기호"

  28. 28

    아키텍처 arm64에 대한 Xcode 8.0 정의되지 않은 기호

  29. 29

    ARM64 (iOS) 아키텍처에 대한 정의되지 않은 기호

뜨겁다태그

보관